Reaction Details
TargetHeat shock protein HSP 90-beta
LigandBDBM20758
Substrate/CompetitorBDBM10852
Meas. Tech.Her-2 Degradation Assay
pH7.2±n/a
Temperature310.15±n/a K
EC50 180±n/a nM
CommentsEC50=250 nM in MTS cell-growth inhibition assay.
Citation Zhang, LFan, JVu, KHong, KLe Brazidec, JYShi, JBiamonte, MBusch, DJLough, REGrecko, RRan, YSensintaffar, JLKamal, ALundgren, KBurrows, FJMansfield, RTimony, GAUlm, EHKasibhatla, SRBoehm, MF 7'-substituted benzothiazolothio- and pyridinothiazolothio-purines as potent heat shock protein 90 inhibitors. J Med Chem49:5352-62 (2006) 
 
Heat shock protein HSP 90-beta
Name:Heat shock protein HSP 90-beta
Type:Molecular Chaperone
Mol. Mass.:83229.45
Organism:Homo sapiens (Human)
Description:P08238
Residue:724
BDBM20758
BDBM10852
NameBDBM20758
Synonyms:9-butyl-8-[(7-chloro-1,3-benzothiazol-2-yl)sulfanyl]-9H-purin-6-amine CHEMBL213262
TypeSmall organic molecule
Emp. Form.C16H15ClN6S2
Mol. Mass.390.914
SMILESCCCCn1c(Sc2nc3cccc(Cl)c3s2)nc2c(N)ncnc12