Reaction Details
TargetHeat shock protein HSP 90-beta
LigandBDBM20759
Substrate/CompetitorBDBM10852
Meas. Tech.Her-2 Degradation Assay
pH7.2±n/a
Temperature310.15±n/a K
EC50 330±n/a nM
CommentsEC50=2000 nM in MTS cell-growth inhibition assay.
Citation Zhang, LFan, JVu, KHong, KLe Brazidec, JYShi, JBiamonte, MBusch, DJLough, REGrecko, RRan, YSensintaffar, JLKamal, ALundgren, KBurrows, FJMansfield, RTimony, GAUlm, EHKasibhatla, SRBoehm, MF 7'-substituted benzothiazolothio- and pyridinothiazolothio-purines as potent heat shock protein 90 inhibitors. J Med Chem49:5352-62 (2006) 
 
Heat shock protein HSP 90-beta
Name:Heat shock protein HSP 90-beta
Type:Molecular Chaperone
Mol. Mass.:83229.45
Organism:Homo sapiens (Human)
Description:P08238
Residue:724
BDBM20759
BDBM10852
NameBDBM20759
Synonyms:8-[(7-bromo-1,3-benzothiazol-2-yl)sulfanyl]-9-butyl-9H-purin-6-amine | Benzothiazole analogue, 12
TypeSmall organic molecule
Emp. Form.C16H15BrN6S2
Mol. Mass.435.365
SMILESCCCCn1c(Sc2nc3cccc(Br)c3s2)nc2c(N)ncnc12