Reaction Details
TargetHeat shock protein HSP 90-beta
LigandBDBM20775
Substrate/CompetitorBDBM10852
Meas. Tech.Her-2 Degradation Assay
pH7.2±n/a
Temperature310.15±n/a K
EC50 150±n/a nM
CommentsEC50=200 nM in MTS cell-growth inhibition assay.
Citation Zhang, LFan, JVu, KHong, KLe Brazidec, JYShi, JBiamonte, MBusch, DJLough, REGrecko, RRan, YSensintaffar, JLKamal, ALundgren, KBurrows, FJMansfield, RTimony, GAUlm, EHKasibhatla, SRBoehm, MF 7'-substituted benzothiazolothio- and pyridinothiazolothio-purines as potent heat shock protein 90 inhibitors. J Med Chem49:5352-62 (2006) 
 
Heat shock protein HSP 90-beta
Name:Heat shock protein HSP 90-beta
Type:Molecular Chaperone
Mol. Mass.:83229.45
Organism:Homo sapiens (Human)
Description:P08238
Residue:724
BDBM20775
BDBM10852
NameBDBM20775
Synonyms:4-{6-amino-8-[(7-chloro-1,3-benzothiazol-2-yl)sulfanyl]-9H-purin-9-yl}butan-1-ol | Benzothiazole analogue, 33
TypeSmall organic molecule
Emp. Form.C16H15ClN6OS2
Mol. Mass.406.913
SMILESNc1ncnc2n(CCCCO)c(Sc3nc4cccc(Cl)c4s3)nc12