Reaction Details
TargetFatty acid synthase
LigandBDBM244436
Substrate/Competitorn/a
Meas. Tech.FASN Inhibition
IC50 9.00±n/a nM
Citation Heuer, TSOslob, JDMcDowell, RSJohnson, RYang, HEvanchik, MZaharia, CACai, HHu, LWDuke, GOhol-Gupta, YO Farrell, M Heterocyclic modulators of lipid synthesis and combinations thereof US Patent US10226449 Publication Date 3/12/2019
 
Fatty acid synthase
Name:Fatty acid synthase
Type:Enzyme
Mol. Mass.:273419.37
Organism:Homo sapiens (Human)
Description:P49327
Residue:2511
BDBM244436
NameBDBM244436
Synonyms:US10226449, cpd 45 | US9428502, 45
TypeSmall organic molecule
Emp. Form.C24H23ClN4O
Mol. Mass.418.919
SMILESCC(C)c1nc(Cl)c([nH]1)-c1cc(ccc1C)C(=O)N1CC(C1)c1ccc(cc1)C#N