Reaction Details
TargetHeat shock protein HSP 90-beta
LigandBDBM20790
Substrate/CompetitorBDBM10852
Meas. Tech.Her-2 Degradation Assay
pH7.2±n/a
Temperature310.15±n/a K
EC50 70±n/a nM
Citation Kasibhatla, SRHong, KBiamonte, MABusch, DJKarjian, PLSensintaffar, JLKamal, ALough, REBrekken, JLundgren, KGrecko, RTimony, GARan, YMansfield, RFritz, LCUlm, EBurrows, FJBoehm, MF Rationally designed high-affinity 2-amino-6-halopurine heat shock protein 90 inhibitors that exhibit potent antitumor activity. J Med Chem50:2767-78 (2007) 
 
Heat shock protein HSP 90-beta
Name:Heat shock protein HSP 90-beta
Type:Molecular Chaperone
Mol. Mass.:83229.45
Organism:Homo sapiens (Human)
Description:P08238
Residue:724
BDBM20790
BDBM10852
NameBDBM20790
Synonyms:2-amino-6-halopurine analogue, 18b | 9-[(2-bromo-3,4,5-trimethoxyphenyl)methyl]-6-chloro-9H-purin-2-amine
TypeSmall organic molecule
Emp. Form.C15H15BrClN5O3
Mol. Mass.428.668
SMILESCOc1cc(Cn2cnc3c(Cl)nc(N)nc23)c(Br)c(OC)c1OC