Reaction Details
TargetHeat shock protein HSP 90-beta
LigandBDBM20807
Substrate/CompetitorBDBM10852
Meas. Tech.Her-2 Degradation Assay
EC50 15±n/a nM
Citation Kasibhatla, SRHong, KBiamonte, MABusch, DJKarjian, PLSensintaffar, JLKamal, ALough, REBrekken, JLundgren, KGrecko, RTimony, GARan, YMansfield, RFritz, LCUlm, EBurrows, FJBoehm, MF Rationally designed high-affinity 2-amino-6-halopurine heat shock protein 90 inhibitors that exhibit potent antitumor activity. J Med Chem50:2767-78 (2007) 
 
Heat shock protein HSP 90-beta
Name:Heat shock protein HSP 90-beta
Type:Molecular Chaperone
Mol. Mass.:83229.45
Organism:Homo sapiens (Human)
Description:P08238
Residue:724
BDBM20807
BDBM10852
NameBDBM20807
Synonyms:2-amino-6-halopurine analogue, 29 hsp90_108
TypeSmall organic molecule
Emp. Form.C13H12BrClN6
Mol. Mass.367.632
SMILESCc1cnc(Cn2cnc3c(Cl)nc(N)nc23)c(C)c1Br