Reaction Details
TargetNuclear factor NF-kappa-B p105 subunit
LigandBDBM367238
Substrate/Competitorn/a
Meas. Tech.Electrophoretic Mobility Shift Assay (EMSA)
IC50<500±n/a nM
Citation Ouk, SLiou, H Small molecule NF-κB inhibitors US Patent US10226464 Publication Date 3/12/2019
 
Nuclear factor NF-kappa-B p105 subunit
Name:Nuclear factor NF-kappa-B p105 subunit
Type:Protein
Mol. Mass.:105329.57
Organism:Homo sapiens (Human)
Description:P19838
Residue:968
BDBM367238
NameBDBM367238
Synonyms:US10226464, Compound 8
TypeSmall organic molecule
Emp. Form.C12H8N2O3S
Mol. Mass.260.269
SMILESCOc1ccc2cc3c(nc(=S)[nH]c3=O)oc2c1