Reaction Details
TargetSodium/glucose cotransporter 2
LigandBDBM20875
Substrate/CompetitorBDBM20876
Meas. Tech.SGLT Binding Assay
pH7.2±n/a
Temperature295.15±n/a K
EC50 35.6±4.2 nM
Citation Meng, WEllsworth, BANirschl, AAMcCann, PJPatel, MGirotra, RNWu, GSher, PMMorrison, EPBiller, SAZahler, RDeshpande, PPPullockaran, AHagan, DLMorgan, NTaylor, JRObermeier, MTHumphreys, WGKhanna, ADiscenza, LRobertson, JGWang, AHan, SWetterau, JRJanovitz, EBFlint, OPWhaley, JMWashburn, WN Discovery of Dapagliflozin: A Potent, Selective Renal Sodium-Dependent Glucose Cotransporter 2 (SGLT2) Inhibitor for the Treatment of Type 2 Diabetes. J Med Chem51:1145-9 (2008) 
 
Sodium/glucose cotransporter 2
Name:Sodium/glucose cotransporter 2
Type:Protein
Mol. Mass.:72902.00
Organism:Homo sapiens (Human)
Description:P31639
Residue:672
BDBM20875
BDBM20876
NameBDBM20875
Synonyms:1-(2,4-dihydroxy-6-{[(2S,3R,4S,5S,6R)-3,4,5-trihydroxy-6-(hydroxymethyl)oxan-2-yl]oxy}phenyl)-3-(4-hydroxyphenyl)propan-1-one CHEMBL245067 O-glucoside, 1 | Phlorizin
TypeNatural product
Emp. Form.C21H24O10
Mol. Mass.436.4093
SMILESOC[C@H]1O[C@@H](Oc2cc(O)cc(O)c2C(=O)CCc2ccc(O)cc2)[C@H](O)[C@@H](O)[C@@H]1O