Reaction Details
TargetSodium/glucose cotransporter 1
LigandBDBM20878
Substrate/CompetitorBDBM20876
Meas. Tech.SGLT Binding Assay
pH7.2±n/a
Temperature295.15±n/a K
EC50>8000±n/a nM
Citation Meng, WEllsworth, BANirschl, AAMcCann, PJPatel, MGirotra, RNWu, GSher, PMMorrison, EPBiller, SAZahler, RDeshpande, PPPullockaran, AHagan, DLMorgan, NTaylor, JRObermeier, MTHumphreys, WGKhanna, ADiscenza, LRobertson, JGWang, AHan, SWetterau, JRJanovitz, EBFlint, OPWhaley, JMWashburn, WN Discovery of Dapagliflozin: A Potent, Selective Renal Sodium-Dependent Glucose Cotransporter 2 (SGLT2) Inhibitor for the Treatment of Type 2 Diabetes. J Med Chem51:1145-9 (2008) 
 
Sodium/glucose cotransporter 1
Name:Sodium/glucose cotransporter 1
Type:Protein
Mol. Mass.:73503.78
Organism:Homo sapiens (Human)
Description:P13866
Residue:664
BDBM20878
BDBM20876
NameBDBM20878
Synonyms:(2R,3S,4S,5R,6S)-2-(hydroxymethyl)-6-{2-[(4-methoxyphenyl)methyl]phenoxy}oxane-3,4,5-triol O-glucoside, 4a
TypeSmall organic molecule
Emp. Form.C20H24O7
Mol. Mass.376.4004
SMILESCOc1ccc(Cc2ccccc2O[C@@H]2O[C@H](CO)[C@@H](O)[C@H](O)[C@H]2O)cc1