Reaction Details
TargetHeat shock protein HSP 90-beta
LigandBDBM20897
Substrate/CompetitorBDBM15527
Meas. Tech.Fluorescence Polarization (FP) Assay and Cell Growth Inhibition (SRB) Assay
pH7.4±n/a
Temperature295.15±n/a K
IC50 914±n/a nM
EC50 9240±n/a nM
Citation Brough, PAAherne, WBarril, XBorgognoni, JBoxall, KCansfield, JECheung, KMCollins, IDavies, NGDrysdale, MJDymock, BEccles, SAFinch, HFink, AHayes, AHowes, RHubbard, REJames, KJordan, AMLockie, AMartins, VMassey, AMatthews, TPMcDonald, ENorthfield, CJPearl, LHProdromou, CRay, SRaynaud, FIRoughley, SDSharp, SYSurgenor, AWalmsley, DLWebb, PWood, MWorkman, PWright, L 4,5-diarylisoxazole Hsp90 chaperone inhibitors: potential therapeutic agents for the treatment of cancer. J Med Chem51:196-218 (2008) 
 
Heat shock protein HSP 90-beta
Name:Heat shock protein HSP 90-beta
Type:Molecular Chaperone
Mol. Mass.:83229.45
Organism:Homo sapiens (Human)
Description:P08238
Residue:724
BDBM20897
BDBM15527
NameBDBM20897
Synonyms:3-(5-chloro-2,4-dihydroxyphenyl)-N-ethyl-4-(3-{[(2-hydroxyethyl)(methyl)amino]methyl}phenyl)-1H-pyrazole-5-carboxamide | Pyrazole, 20h
TypeSmall organic molecule
Emp. Form.C22H25ClN4O4
Mol. Mass.444.911
SMILESCCNC(=O)c1[nH]nc(c1-c1cccc(CN(C)CCO)c1)-c1cc(Cl)c(O)cc1O