Reaction Details
TargetHeat shock protein HSP 90-beta
LigandBDBM20904
Substrate/CompetitorBDBM15527
Meas. Tech.Fluorescence Polarization (FP) Assay and Cell Growth Inhibition (SRB) Assay
pH7.4±n/a
Temperature295.15±n/a K
IC50 64±n/a nM
EC50 56±n/a nM
Citation Brough, PAAherne, WBarril, XBorgognoni, JBoxall, KCansfield, JECheung, KMCollins, IDavies, NGDrysdale, MJDymock, BEccles, SAFinch, HFink, AHayes, AHowes, RHubbard, REJames, KJordan, AMLockie, AMartins, VMassey, AMatthews, TPMcDonald, ENorthfield, CJPearl, LHProdromou, CRay, SRaynaud, FIRoughley, SDSharp, SYSurgenor, AWalmsley, DLWebb, PWood, MWorkman, PWright, L 4,5-diarylisoxazole Hsp90 chaperone inhibitors: potential therapeutic agents for the treatment of cancer. J Med Chem51:196-218 (2008) 
 
Heat shock protein HSP 90-beta
Name:Heat shock protein HSP 90-beta
Type:Molecular Chaperone
Mol. Mass.:83229.45
Organism:Homo sapiens (Human)
Description:P08238
Residue:724
BDBM20904
BDBM15527
NameBDBM20904
Synonyms:5-(5-chloro-2,4-dihydroxyphenyl)-4-{4-[(diethylamino)methyl]phenyl}-N-ethyl-1,2-oxazole-3-carboxamide US10413550, Example 49 US9718793, 49
TypeSmall organic molecule
Emp. Form.C23H26ClN3O4
Mol. Mass.443.923
SMILESCCNC(=O)c1noc(c1-c1ccc(CN(CC)CC)cc1)-c1cc(Cl)c(O)cc1O