Reaction Details
TargetHeat shock protein HSP 90-beta
LigandBDBM20907
Substrate/CompetitorBDBM15527
Meas. Tech.Fluorescence Polarization (FP) Assay and Cell Growth Inhibition (SRB) Assay
pH7.4±n/a
Temperature295.15±n/a K
IC50 39±n/a nM
EC50 118±n/a nM
Citation Brough, PAAherne, WBarril, XBorgognoni, JBoxall, KCansfield, JECheung, KMCollins, IDavies, NGDrysdale, MJDymock, BEccles, SAFinch, HFink, AHayes, AHowes, RHubbard, REJames, KJordan, AMLockie, AMartins, VMassey, AMatthews, TPMcDonald, ENorthfield, CJPearl, LHProdromou, CRay, SRaynaud, FIRoughley, SDSharp, SYSurgenor, AWalmsley, DLWebb, PWood, MWorkman, PWright, L 4,5-diarylisoxazole Hsp90 chaperone inhibitors: potential therapeutic agents for the treatment of cancer. J Med Chem51:196-218 (2008) 
 
Heat shock protein HSP 90-beta
Name:Heat shock protein HSP 90-beta
Type:Molecular Chaperone
Mol. Mass.:83229.45
Organism:Homo sapiens (Human)
Description:P08238
Residue:724
BDBM20907
BDBM15527
NameBDBM20907
Synonyms:5-(5-chloro-2,4-dihydroxyphenyl)-N-ethyl-4-[4-(pyrrolidin-1-ylmethyl)phenyl]-1,2-oxazole-3-carboxamide US10413550, Example 54 US9718793, 54
TypeSmall organic molecule
Emp. Form.C23H24ClN3O4
Mol. Mass.441.907
SMILESCCNC(=O)c1noc(c1-c1ccc(CN2CCCC2)cc1)-c1cc(Cl)c(O)cc1O