Reaction Details
TargetHeat shock protein HSP 90-beta
LigandBDBM20910
Substrate/CompetitorBDBM15527
Meas. Tech.Fluorescence Polarization (FP) Assay and Cell Growth Inhibition (SRB) Assay
IC50 343±n/a nM
EC50 2780±n/a nM
Citation Brough, PAAherne, WBarril, XBorgognoni, JBoxall, KCansfield, JECheung, KMCollins, IDavies, NGDrysdale, MJDymock, BEccles, SAFinch, HFink, AHayes, AHowes, RHubbard, REJames, KJordan, AMLockie, AMartins, VMassey, AMatthews, TPMcDonald, ENorthfield, CJPearl, LHProdromou, CRay, SRaynaud, FIRoughley, SDSharp, SYSurgenor, AWalmsley, DLWebb, PWood, MWorkman, PWright, L 4,5-diarylisoxazole Hsp90 chaperone inhibitors: potential therapeutic agents for the treatment of cancer. J Med Chem51:196-218 (2008) 
 
Heat shock protein HSP 90-beta
Name:Heat shock protein HSP 90-beta
Type:Molecular Chaperone
Mol. Mass.:83229.45
Organism:Homo sapiens (Human)
Description:P08238
Residue:724
BDBM20910
BDBM15527
NameBDBM20910
Synonyms:5-(5-chloro-2,4-dihydroxyphenyl)-N-ethyl-4-{3-[(4-methylpiperazin-1-yl)methyl]phenyl}-1,2-oxazole-3-carboxamide US10413550, Example 48 US9718793, 48
TypeSmall organic molecule
Emp. Form.C24H27ClN4O4
Mol. Mass.470.949
SMILESCCNC(=O)c1noc(c1-c1cccc(CN2CCN(C)CC2)c1)-c1cc(Cl)c(O)cc1O