Reaction Details
TargetHeat shock protein HSP 90-beta
LigandBDBM20916
Substrate/CompetitorBDBM15527
Meas. Tech.Fluorescence Polarization (FP) Assay and Cell Growth Inhibition (SRB) Assay
IC50 26±n/a nM
EC50 29±n/a nM
Citation Brough, PAAherne, WBarril, XBorgognoni, JBoxall, KCansfield, JECheung, KMCollins, IDavies, NGDrysdale, MJDymock, BEccles, SAFinch, HFink, AHayes, AHowes, RHubbard, REJames, KJordan, AMLockie, AMartins, VMassey, AMatthews, TPMcDonald, ENorthfield, CJPearl, LHProdromou, CRay, SRaynaud, FIRoughley, SDSharp, SYSurgenor, AWalmsley, DLWebb, PWood, MWorkman, PWright, L 4,5-diarylisoxazole Hsp90 chaperone inhibitors: potential therapeutic agents for the treatment of cancer. J Med Chem51:196-218 (2008) 
 
Heat shock protein HSP 90-beta
Name:Heat shock protein HSP 90-beta
Type:Molecular Chaperone
Mol. Mass.:83229.45
Organism:Homo sapiens (Human)
Description:P08238
Residue:724
BDBM20916
BDBM15527
NameBDBM20916
Synonyms:Isoxazole, 41i | N-ethyl-5-{5-[2-(4-fluorophenyl)ethyl]-2,4-dihydroxyphenyl}-4-[4-(piperidin-1-ylmethyl)phenyl]-1,2-oxazole-3-carboxamide
TypeSmall organic molecule
Emp. Form.C32H34FN3O4
Mol. Mass.543.6285
SMILESCCNC(=O)c1noc(c1-c1ccc(CN2CCCCC2)cc1)-c1cc(CCc2ccc(F)cc2)c(O)cc1O