Reaction Details
TargetHeat shock protein HSP 90-beta
LigandBDBM20924
Substrate/CompetitorBDBM15527
Meas. Tech.Fluorescence Polarization (FP) Assay and Cell Growth Inhibition (SRB) Assay
IC50 8±n/a nM
EC50 70±n/a nM
Citation Brough, PAAherne, WBarril, XBorgognoni, JBoxall, KCansfield, JECheung, KMCollins, IDavies, NGDrysdale, MJDymock, BEccles, SAFinch, HFink, AHayes, AHowes, RHubbard, REJames, KJordan, AMLockie, AMartins, VMassey, AMatthews, TPMcDonald, ENorthfield, CJPearl, LHProdromou, CRay, SRaynaud, FIRoughley, SDSharp, SYSurgenor, AWalmsley, DLWebb, PWood, MWorkman, PWright, L 4,5-diarylisoxazole Hsp90 chaperone inhibitors: potential therapeutic agents for the treatment of cancer. J Med Chem51:196-218 (2008) 
 
Heat shock protein HSP 90-beta
Name:Heat shock protein HSP 90-beta
Type:Molecular Chaperone
Mol. Mass.:83229.45
Organism:Homo sapiens (Human)
Description:P08238
Residue:724
BDBM20924
BDBM15527
NameBDBM20924
Synonyms:5-(5-tert-butyl-2,4-dihydroxyphenyl)-N-ethyl-4-[4-(morpholin-4-ylmethyl)phenyl]-1,2-oxazole-3-carboxamide US10413550, Example 77a US9718793, 77a
TypeSmall organic molecule
Emp. Form.C27H33N3O5
Mol. Mass.479.568
SMILESCCNC(=O)c1noc(c1-c1ccc(CN2CCOCC2)cc1)-c1cc(c(O)cc1O)C(C)(C)C