Reaction Details
TargetProcathepsin L
LigandBDBM21001
Substrate/CompetitorBDBM20994
Meas. Tech.Enzyme Inhibition Assay
pH5.5±n/a
Temperature298.15±n/a K
Ki 511±n/a nM
Citation Chowdhury, SFJoseph, LKumar, STulsidas, SRBhat, SZiomek, EMénard, RSivaraman, JPurisima, EO Exploring inhibitor binding at the s' subsites of cathepsin L. J Med Chem51:1361-8 (2008) 
 
Procathepsin L
Name:Procathepsin L
Type:Enzyme
Mol. Mass.:37557.19
Organism:Homo sapiens (Human)
Description:Purchased from Calbiochem (San Diego, CA).
Residue:333
BDBM21001
BDBM20994
NameBDBM21001
Synonyms:(2S)-N-[(1R)-4-[(diaminomethylidene)amino]-1-{[(1S)-2-phenyl-1-[(2-phenylethyl)carbamoyl]ethyl]carbamoyl}butyl]-2,6-bis[1-(4-phenylphenyl)acetamido]hexanamide | Tripeptide derivative, 9
TypeSmall organic molecule
Emp. Form.C57H64N8O5
Mol. Mass.941.1687
SMILES[#7]\[#6](-[#7])=[#7]/[#6]-[#6]-[#6]-[#6@@H](-[#7]-[#6](=O)-[#6@H](-[#6]-[#6]-[#6]-[#6]-[#7]-[#6](=O)-[#6]-c1ccc(cc1)-c1ccccc1)-[#7]-[#6](=O)-[#6]-c1ccc(cc1)-c1ccccc1)-[#6](=O)-[#7]-[#6@@H](-[#6]-c1ccccc1)-[#6](=O)-[#7]-[#6]-[#6]-c1ccccc1