Reaction Details
TargetDelta-type opioid receptor
LigandBDBM21023
Substrate/CompetitorBDBM21008
Meas. Tech.Radioligand Labeled Binding Assay and [35S]GTP-gamma-S Binding Assay
pH7.4±n/a
Temperature298.15±n/a K
Ki 1.8±n/a nM
EC50 4.0±n/a nM
Citation Yamamoto, TNair, PDavis, PMa, SWNavratilova, EMoye, STumati, SLai, JVanderah, TWYamamura, HIPorreca, FHruby, VJ Design, synthesis, and biological evaluation of novel bifunctional C-terminal-modified peptides for delta/mu opioid receptor agonists and neurokinin-1 receptor antagonists. J Med Chem50:2779-86 (2007) 
 
Delta-type opioid receptor
Name:Delta-type opioid receptor
Type:G Protein-Coupled Receptor (GPCR)
Mol. Mass.:40382.98
Organism:Homo sapiens (Human)
Description:Competition binding assays were carried out using membrane preparations from transfected HN9.10 cells that constitutively expressed the delta opioid receptor.
Residue:372
BDBM21023
BDBM21008
NameBDBM21023
Synonyms:Bifunctional Peptide Ligand, 7 (TY018) [3,5-bis(trifluoromethyl)phenyl]methyl (2S)-2-[(2S)-2-{[(2S)-1-[(2S)-2-[(2S)-2-{2-[(2R)-2-[(2S)-2-amino-3-(4-hydroxyphenyl)propanamido]propanamido]acetamido}-3-phenylpropanamido]hexanoyl]pyrrolidin-2-yl]formamido}-4-methylpentanamido]-3-(1H-indol-3-yl)propanoate
TypePeptide-like ligand
Emp. Form.C60H71F6N9O10
Mol. Mass.1192.2505
SMILESCCCC[C@H](NC(=O)[C@H](Cc1ccccc1)NC(=O)CNC(=O)[C@@H](C)NC(=O)[C@@H](N)Cc1ccc(O)cc1)C(=O)N1CCC[C@H]1C(=O)N[C@@H](CC(C)C)C(=O)N[C@@H](Cc1c[nH]c2ccccc12)C(=O)OCc1cc(cc(c1)C(F)(F)F)C(F)(F)F