Reaction Details
TargetSerine/threonine-protein kinase MARK2
LigandBDBM247039
Substrate/Competitorn/a
Meas. Tech.PAR-1 FLIPR Assay
IC50 4.07±n/a nM
Citation Yang, ZZhang, FDong, GKnowles, SLMaletic, M Preparation and use of 7a-amide substituted- 6,6-difluoro bicyclic himbacine derivatives as PAR-1 receptor antagonists US Patent US9701669 Publication Date 7/11/2017
 
Serine/threonine-protein kinase MARK2
Name:Serine/threonine-protein kinase MARK2
Type:PROTEIN
Mol. Mass.:87953.09
Organism:Homo sapiens (Human)
Description:ChEMBL_774586
Residue:788
BDBM247039
NameBDBM247039
Synonyms:2-((1R,3aR, 6S,7R,7aS)-7- ((E)-2-(5-(2- cyanophenyl) pyridin-2- yl)vinyl)-5,5- difluoro- 1,6-dimethyl-3- oxooctahydro- isobenzofuran- 3a- yl)propanamide US9701669, 8 | US9701669, 9
TypeSmall organic molecule
Emp. Form.C27H27F2N3O3
Mol. Mass.479.5184
SMILESCC(C(N)=O)[C@@]12CC(F)(F)[C@@H](C)[C@H](\C=C\c3ccc(cn3)-c3ccccc3C#N)[C@@H]1[C@@H](C)OC2=O