Reaction Details
TargetSerine/threonine-protein kinase MARK2
LigandBDBM247046
Substrate/Competitorn/a
Meas. Tech.PAR-1 FLIPR Assay
IC50 21.2±n/a nM
Citation Yang, ZZhang, FDong, GKnowles, SLMaletic, M Preparation and use of 7a-amide substituted- 6,6-difluoro bicyclic himbacine derivatives as PAR-1 receptor antagonists US Patent US9701669 Publication Date 7/11/2017
 
Serine/threonine-protein kinase MARK2
Name:Serine/threonine-protein kinase MARK2
Type:PROTEIN
Mol. Mass.:87953.09
Organism:Homo sapiens (Human)
Description:ChEMBL_774586
Residue:788
BDBM247046
NameBDBM247046
Synonyms:2-((1R,3aR,6S, 7R,7aS)-7-((E)- 2- (2'-cyano-[3,3'- bipyridin]-6- yl)vinyl)-5,5- difluoro-1,6- dimethyl-3- oxooctahydro- isobenzofuran- 3a- yl)acetamide | US9701669, 17
TypeSmall organic molecule
Emp. Form.C25H24F2N4O3
Mol. Mass.466.4799
SMILESC[C@H]1OC(=O)[C@]2(CC(N)=O)CC(F)(F)[C@@H](C)[C@H](\C=C\c3ccc(cn3)-c3cccnc3C#N)[C@H]12