Reaction Details
TargetPotassium voltage-gated channel subfamily H member 2
LigandBDBM247039
Substrate/Competitorn/a
Meas. Tech.MK-499 Filter Binding Assay
pH7.4±n/a
Temperature298.15±n/a K
IC50 59700±n/a nM
Commentsextracted
Citation Yang, ZZhang, FDong, GKnowles, SLMaletic, M Preparation and use of 7a-amide substituted- 6,6-difluoro bicyclic himbacine derivatives as PAR-1 receptor antagonists US Patent US9701669 Publication Date 7/11/2017
 
Potassium voltage-gated channel subfamily H member 2
Name:Potassium voltage-gated channel subfamily H member 2
Type:Multi-pass membrane protein
Mol. Mass.:126672.65
Organism:Homo sapiens (Human)
Description:Q12809
Residue:1159
BDBM247039
NameBDBM247039
Synonyms:2-((1R,3aR, 6S,7R,7aS)-7- ((E)-2-(5-(2- cyanophenyl) pyridin-2- yl)vinyl)-5,5- difluoro- 1,6-dimethyl-3- oxooctahydro- isobenzofuran- 3a- yl)propanamide US9701669, 8 | US9701669, 9
TypeSmall organic molecule
Emp. Form.C27H27F2N3O3
Mol. Mass.479.5184
SMILESCC(C(N)=O)[C@@]12CC(F)(F)[C@@H](C)[C@H](\C=C\c3ccc(cn3)-c3ccccc3C#N)[C@@H]1[C@@H](C)OC2=O