Reaction Details
TargetDelta-type opioid receptor
LigandBDBM21132
Substrate/CompetitorBDBM21008
Meas. Tech.Radioligand Labeled Binding Assay and [35S]GTP-gamma-S Binding Assay
pH7.4±n/a
Temperature298.15±n/a K
Ki 2.2±n/a nM
EC50 120±n/a nM
Citation Agnes, RSLee, YSDavis, PMa, SWBadghisi, HPorreca, FLai, JHruby, VJ Structure-activity relationships of bifunctional peptides based on overlapping pharmacophores at opioid and cholecystokinin receptors. J Med Chem49:2868-75 (2006) 
 
Delta-type opioid receptor
Name:Delta-type opioid receptor
Type:G Protein-Coupled Receptor (GPCR)
Mol. Mass.:40382.98
Organism:Homo sapiens (Human)
Description:Competition binding assays were carried out using membrane preparations from transfected HN9.10 cells that constitutively expressed the delta opioid receptor.
Residue:372
BDBM21132
BDBM21008
NameBDBM21132
Synonyms:(3S)-3-[(2S)-2-[(2S)-2-{2-[(2R)-2-[(2S)-2-amino-3-(4-hydroxyphenyl)propanamido]propanamido]acetamido}-3-(1H-indol-3-yl)-N-methylpropanamido]hexanamido]-3-{[(1S)-1-carbamoyl-2-phenylethyl]carbamoyl}propanoic acid Tyr-D-Ala-Gly-Trp-NMeNle-Asp-Phe-NH2
TypePeptide
Emp. Form.C45H57N9O10
Mol. Mass.883.9884
SMILESCCCC[C@H](N(C)C(=O)[C@H](Cc1c[nH]c2ccccc12)NC(=O)CNC(=O)[C@@H](C)NC(=O)[C@@H](N)Cc1ccc(O)cc1)C(=O)N[C@@H](CC(O)=O)C(=O)N[C@@H](Cc1ccccc1)C(N)=O