Reaction Details
TargetCholecystokinin receptor type A
LigandBDBM21139
Substrate/Competitor[125I]CCK-8
Meas. Tech.Radioligand Labeled Binding Assay and Phosphatidylinositol Hydrolysis Assay for the CCK Receptor
Ki 9.6±n/a nM
EC50 2500±n/a nM
Citation Agnes, RSLee, YSDavis, PMa, SWBadghisi, HPorreca, FLai, JHruby, VJ Structure-activity relationships of bifunctional peptides based on overlapping pharmacophores at opioid and cholecystokinin receptors. J Med Chem49:2868-75 (2006) 
 
Cholecystokinin receptor type A
Name:Cholecystokinin receptor type A
Type:G Protein-Coupled Receptor (GPCR)
Mol. Mass.:47859.34
Organism:Homo sapiens (Human)
Description:Stable expression of human CCK-1 receptors in HEK 293 cells.
Residue:428
BDBM21139
[125I]CCK-8
NameBDBM21139
Synonyms:(3S)-3-[(2S)-2-[(2S)-2-{2-[(2R)-2-[(2S)-2-amino-3-(4-hydroxyphenyl)propanamido]hexanamido]acetamido}-3-(1H-indol-3-yl)propanamido]hexanamido]-3-{[(1S)-1-carbamoyl-2-phenylethyl]carbamoyl}propanoic acid Tyr-D-Nle-Gly-Trp-Nle-Asp-Phe-NH2
TypePeptide
Emp. Form.C47H61N9O10
Mol. Mass.912.0415
SMILESCCCC[C@@H](NC(=O)[C@@H](N)Cc1ccc(O)cc1)C(=O)NCC(=O)N[C@@H](Cc1c[nH]c2ccccc12)C(=O)N[C@@H](CCCC)C(=O)N[C@@H](CC(O)=O)C(=O)N[C@@H](Cc1ccccc1)C(N)=O