Reaction Details
TargetCytochrome P450 3A4
LigandBDBM21149
Substrate/CompetitorBDBM21150
Meas. Tech.CYP3A4 Enzyme Inhibition Assay
pH7.4±n/a
Temperature310.15±n/a K
IC50 1300±200 nM
Citation Ahlström, MMZamora, I Characterization of Type II Ligands in CYP2C9 and CYP3A4. J Med Chem51:1755-1763 (2008) 
 
Cytochrome P450 3A4
Name:Cytochrome P450 3A4
Type:Enzyme
Mol. Mass.:57349.57
Organism:Homo sapiens (Human)
Description:n/a
Residue:503
BDBM21149
BDBM21150
NameBDBM21149
Synonyms:4-[5-(benzylsulfanyl)-4-(4-bromophenyl)-4H-1,2,4-triazol-3-yl]pyridine | Pyridine-based ligand, 1
TypeSmall organic molecule
Emp. Form.C20H15BrN4S
Mol. Mass.423.329
SMILESBrc1ccc(cc1)-n1c(SCc2ccccc2)nnc1-c1ccncc1