Reaction Details
TargetCytochrome P450 3A4
LigandBDBM21164
Substrate/CompetitorBDBM21150
Meas. Tech.CYP3A4 Enzyme Inhibition Assay
pH7.4±n/a
Temperature310.15±n/a K
IC50 45±7 nM
Citation Ahlström, MMZamora, I Characterization of Type II Ligands in CYP2C9 and CYP3A4. J Med Chem51:1755-1763 (2008) 
 
Cytochrome P450 3A4
Name:Cytochrome P450 3A4
Type:Enzyme
Mol. Mass.:57349.57
Organism:Homo sapiens (Human)
Description:n/a
Residue:503
BDBM21164
BDBM21150
NameBDBM21164
Synonyms:1-[2-(4-methoxyphenyl)-2-[3-(4-methoxyphenyl)propoxy]ethyl]-1H-imidazole | Imidazole-based ligand, 15
TypeSmall organic molecule
Emp. Form.C22H26N2O3
Mol. Mass.366.4534
SMILESCOc1ccc(CCCOC(Cn2ccnc2)c2ccc(OC)cc2)cc1