Reaction Details
TargetProto-oncogene tyrosine-protein kinase Src
LigandBDBM247112
Substrate/Competitorn/a
Meas. Tech.c-Src Enzyme Inhibition 1
IC50<1.000±n/a nM
Citation Cariou, CACharron, CEFordyce, EAHamza, DFyfe, MCIto, KKing-Underwood, JMurray, PJOnions, STThom, SMWatson, HTWilliams, JG Pyrazolyl-ureas as kinase inhibitors US Patent US9701670 Publication Date 7/11/2017
 
Proto-oncogene tyrosine-protein kinase Src
Name:Proto-oncogene tyrosine-protein kinase Src
Type:Protein
Mol. Mass.:59838.60
Organism:Homo sapiens (Human)
Description:P12931
Residue:536
BDBM247112
NameBDBM247112
Synonyms:3-((4-((4-(3-(3-(tert-butyl)-1-(6-methoxypyridin-3-yl)-1H-pyrazol-5-yl)ureido)naphthalen-1-yl)oxy)pyrimidin-2-yl)amino)-5-methoxy-N-(2-morpholinoethyl)benzamide | US9701670, 57
TypeSmall organic molecule
Emp. Form.C42H46N10O6
Mol. Mass.786.878
SMILESCOc1cc(Nc2nccc(Oc3ccc(NC(=O)Nc4cc(nn4-c4ccc(OC)nc4)C(C)(C)C)c4ccccc34)n2)cc(c1)C(=O)NCCN1CCOCC1