Reaction Details
TargetMitogen-activated protein kinase 14
LigandBDBM247113
Substrate/Competitorn/a
Meas. Tech.p38 MAPKalpaha Enzyme Inhibition 1
IC50<1.000±n/a nM
Citation Cariou, CACharron, CEFordyce, EAHamza, DFyfe, MCIto, KKing-Underwood, JMurray, PJOnions, STThom, SMWatson, HTWilliams, JG Pyrazolyl-ureas as kinase inhibitors US Patent US9701670 Publication Date 7/11/2017
 
Mitogen-activated protein kinase 14
Name:Mitogen-activated protein kinase 14
Type:Serine/threonine-protein kinase
Mol. Mass.:41286.76
Organism:Homo sapiens (Human)
Description:Q16539
Residue:360
BDBM247113
NameBDBM247113
Synonyms:3-methoxy-5-((4-((4-(3-(1-(4-methoxyphenyl)-3-(tetrahydrofuran-2-yl)-1H-pyrazol-5-yl)ureido)naphthalen-1-yl)oxy)pyrimidin-2-yl)amino)-N-(2-morpholinoethyl)benzamide | US9701670, 58
TypeSmall organic molecule
Emp. Form.C43H45N9O7
Mol. Mass.799.8735
SMILESCOc1ccc(cc1)-n1nc(cc1NC(=O)Nc1ccc(Oc2ccnc(Nc3cc(OC)cc(c3)C(=O)NCCN3CCOCC3)n2)c2ccccc12)C1CCCO1