Reaction Details
TargetProto-oncogene tyrosine-protein kinase Src
LigandBDBM247123
Substrate/Competitorn/a
Meas. Tech.c-Src Enzyme Inhibition 1
IC50<1.000±n/a nM
Citation Cariou, CACharron, CEFordyce, EAHamza, DFyfe, MCIto, KKing-Underwood, JMurray, PJOnions, STThom, SMWatson, HTWilliams, JG Pyrazolyl-ureas as kinase inhibitors US Patent US9701670 Publication Date 7/11/2017
 
Proto-oncogene tyrosine-protein kinase Src
Name:Proto-oncogene tyrosine-protein kinase Src
Type:Protein
Mol. Mass.:59838.60
Organism:Homo sapiens (Human)
Description:P12931
Residue:536
BDBM247123
NameBDBM247123
Synonyms:3-((4-((4-(3-(3-isopropyl-1-(p-tolyl)-1H-pyrazol-5-yl)ureido)naphthalen-1-yl)oxy)pyrimidin-2-yl)amino)-5-methoxy-N-methyl-N-(2-morpholinoethyl)benzamide | US9701670, 68
TypeSmall organic molecule
Emp. Form.C43H47N9O5
Mol. Mass.769.8906
SMILESCOc1cc(Nc2nccc(Oc3ccc(NC(=O)Nc4cc(nn4-c4ccc(C)cc4)C(C)C)c4ccccc34)n2)cc(c1)C(=O)N(C)CCN1CCOCC1