Reaction Details
TargetEpidermal growth factor receptor [T790M]
LigandBDBM50029668
Substrate/Competitorn/a
Meas. Tech.EGFR Exon 19 Deletion and Exon 20 T790M Concurrent Mutations
IC50<100±n/a nM
Citation Huang, WGong, YLi, FBencivenga, NEDalgarno, DCKohlmann, AShakespeare, WCThomas, RMZhu, XWest, AYoungsaye, WZhang, YZhou, T Heteroaryl compounds for kinase inhibition US Patent US10227342 Publication Date 3/12/2019
 
Epidermal growth factor receptor [T790M]
Name:Epidermal growth factor receptor [T790M]
Type:Enzyme
Mol. Mass.:134309.68
Organism:Homo sapiens (Human)
Description:P00533 (T790M)
Residue:1210
BDBM50029668
NameBDBM50029668
Synonyms:AZD-9291 US10085983, Compound AZD-9291 US11111233, Example AZD9291 US9890168, Compound AZD-9291 | WO2022090481, Example osimertinib
TypeSmall organic molecule
Emp. Form.C28H33N7O2
Mol. Mass.499.6073
SMILESCOc1cc(N(C)CCN(C)C)c(NC(=O)C=C)cc1Nc1nccc(n1)-c1cn(C)c2ccccc12