Reaction Details
TargetCannabinoid receptor 1
LigandBDBM21245
Substrate/CompetitorBDBM21244
Meas. Tech.CB Receptor Binding Assay
pH7.4±n/a
Temperature303.15±n/a K
Ki>2820±n/a nM
Citation Silvestri, RCascio, MGLa Regina, GPiscitelli, FLavecchia, ABrizzi, APasquini, SBotta, MNovellino, EDi Marzo, VCorelli, F Synthesis, Cannabinoid Receptor Affinity, and Molecular Modeling Studies of Substituted 1-Aryl-5-(1H-pyrrol-1-yl)-1H-pyrazole-3-carboxamides. J Med Chem51:1560-76 (2008) 
 
Cannabinoid receptor 1
Name:Cannabinoid receptor 1
Type:G Protein-Coupled Receptor (GPCR)
Mol. Mass.:52868.96
Organism:Homo sapiens (Human)
Description:P21554
Residue:472
BDBM21245
BDBM21244
NameBDBM21245
Synonyms:4-methyl-1-phenyl-N-(piperidin-1-yl)-5-(1H-pyrrol-1-yl)-1H-pyrazole-3-carboxamide | Pyrazole-3-carboxamide analogue, 12
TypeSmall organic molecule
Emp. Form.C20H23N5O
Mol. Mass.349.4295
SMILESCc1c(nn(c1-n1cccc1)-c1ccccc1)C(=O)NN1CCCCC1