Reaction Details
TargetCannabinoid receptor 2
LigandBDBM21243
Substrate/CompetitorBDBM21244
Meas. Tech.CB Receptor Binding Assay
Ki>3940±n/a nM
Citation Silvestri, RCascio, MGLa Regina, GPiscitelli, FLavecchia, ABrizzi, APasquini, SBotta, MNovellino, EDi Marzo, VCorelli, F Synthesis, Cannabinoid Receptor Affinity, and Molecular Modeling Studies of Substituted 1-Aryl-5-(1H-pyrrol-1-yl)-1H-pyrazole-3-carboxamides. J Med Chem51:1560-76 (2008) 
 
Cannabinoid receptor 2
Name:Cannabinoid receptor 2
Type:G Protein-Coupled Receptor (GPCR)
Mol. Mass.:39690.94
Organism:Homo sapiens (Human)
Description:P34972
Residue:360
BDBM21243
BDBM21244
NameBDBM21243
Synonyms:1-phenyl-N-(piperidin-1-yl)-5-(1H-pyrrol-1-yl)-1H-pyrazole-3-carboxamide | Pyrazole-3-carboxamide analogue, 11
TypeSmall organic molecule
Emp. Form.C19H21N5O
Mol. Mass.335.4029
SMILESO=C(NN1CCCCC1)c1cc(-n2cccc2)n(n1)-c1ccccc1