Reaction Details
TargetCannabinoid receptor 2
LigandBDBM21259
Substrate/CompetitorBDBM21244
Meas. Tech.CB Receptor Binding Assay
Ki 3940±n/a nM
Citation Silvestri, RCascio, MGLa Regina, GPiscitelli, FLavecchia, ABrizzi, APasquini, SBotta, MNovellino, EDi Marzo, VCorelli, F Synthesis, Cannabinoid Receptor Affinity, and Molecular Modeling Studies of Substituted 1-Aryl-5-(1H-pyrrol-1-yl)-1H-pyrazole-3-carboxamides. J Med Chem51:1560-76 (2008) 
 
Cannabinoid receptor 2
Name:Cannabinoid receptor 2
Type:G Protein-Coupled Receptor (GPCR)
Mol. Mass.:39690.94
Organism:Homo sapiens (Human)
Description:P34972
Residue:360
BDBM21259
BDBM21244
NameBDBM21259
Synonyms:1-(2,4-dichlorophenyl)-N-[(3,4-dichlorophenyl)methyl]-5-(2,5-dimethyl-1H-pyrrol-1-yl)-4-methyl-1H-pyrazole-3-carboxamide | Pyrazole-3-carboxamide analogue, 26
TypeSmall organic molecule
Emp. Form.C24H20Cl4N4O
Mol. Mass.522.254
SMILESCc1ccc(C)n1-c1c(C)c(nn1-c1ccc(Cl)cc1Cl)C(=O)NCc1ccc(Cl)c(Cl)c1