Reaction Details
TargetSerine/threonine-protein kinase/endoribonuclease IRE1
LigandBDBM160340
Substrate/Competitorn/a
Meas. Tech.IRE-1alpha Assay
pH7.5±n/a
Temperature303.15±n/a K
IC50<100±n/a nM
EC50>10000±n/a nM
Commentsextracted
Citation Zeng, QToro, APatterson, JBWade, WSZubovics, ZYang, YWu, Z IRE-1α inhibitors US Patent US9693992 Publication Date 7/4/2017
 
Serine/threonine-protein kinase/endoribonuclease IRE1
Name:Serine/threonine-protein kinase/endoribonuclease IRE1
Type:Enzyme
Mol. Mass.:109731.20
Organism:Homo sapiens (Human)
Description:O75460
Residue:977
BDBM160340
NameBDBM160340
Synonyms:US9040714, 7 | US9693992, 7
TypeSmall organic molecule
Emp. Form.C16H9BrO4
Mol. Mass.345.144
SMILESOc1ccc2cc(-c3ccc(Br)cc3)c(=O)oc2c1C=O