Reaction Details
TargetSerine/threonine-protein kinase/endoribonuclease IRE1
LigandBDBM160354
Substrate/Competitorn/a
Meas. Tech.IRE-1alpha Assay
pH7.5±n/a
Temperature303.15±n/a K
IC50<100±n/a nM
EC50<10000±n/a nM
Commentsextracted
Citation Zeng, QToro, APatterson, JBWade, WSZubovics, ZYang, YWu, Z IRE-1α inhibitors US Patent US9693992 Publication Date 7/4/2017
 
Serine/threonine-protein kinase/endoribonuclease IRE1
Name:Serine/threonine-protein kinase/endoribonuclease IRE1
Type:Enzyme
Mol. Mass.:109731.20
Organism:Homo sapiens (Human)
Description:O75460
Residue:977
BDBM160354
NameBDBM160354
Synonyms:US9040714, 22 | US9693992, 22
TypeSmall organic molecule
Emp. Form.C11H7ClO4
Mol. Mass.238.624
SMILESCc1cc(=O)oc2c(C=O)c(O)c(Cl)cc12