Reaction Details
TargetCannabinoid receptor 1
LigandBDBM21282
Substrate/CompetitorBDBM21244
Meas. Tech.Radioligand Binding Assay
pH7.4±n/a
Temperature303.15±n/a K
Ki 1204±n/a nM
Citation Frost, JMDart, MJTietje, KRGarrison, TRGrayson, GKDaza, AVEl-Kouhen, OFMiller, LNLi, LYao, BBHsieh, GCPai, MZhu, CZChandran, PMeyer, MD Indol-3-yl-tetramethylcyclopropyl Ketones: Effects of Indole Ring Substitution on CB2 Cannabinoid Receptor Activity. J Med Chem51:1904-12 (2008) 
 
Cannabinoid receptor 1
Name:Cannabinoid receptor 1
Type:G Protein-Coupled Receptor (GPCR)
Mol. Mass.:52868.96
Organism:Homo sapiens (Human)
Description:P21554
Residue:472
BDBM21282
BDBM21244
NameBDBM21282
Synonyms:2-methyl-3-(naphthalen-1-ylcarbonyl)-1-propyl-1H-indole JWH-015
Typen/a
Emp. Form.C23H21NO
Mol. Mass.327.4189
SMILESCCCn1c(C)c(C(=O)c2cccc3ccccc23)c2ccccc12