Reaction Details
TargetCannabinoid receptor 1
LigandBDBM21309
Substrate/CompetitorBDBM21244
Meas. Tech.Radioligand Binding Assay
pH7.4±n/a
Temperature303.15±n/a K
Ki 28±n/a nM
Citation Frost, JMDart, MJTietje, KRGarrison, TRGrayson, GKDaza, AVEl-Kouhen, OFMiller, LNLi, LYao, BBHsieh, GCPai, MZhu, CZChandran, PMeyer, MD Indol-3-yl-tetramethylcyclopropyl Ketones: Effects of Indole Ring Substitution on CB2 Cannabinoid Receptor Activity. J Med Chem51:1904-12 (2008) 
 
Cannabinoid receptor 1
Name:Cannabinoid receptor 1
Type:G Protein-Coupled Receptor (GPCR)
Mol. Mass.:52868.96
Organism:Homo sapiens (Human)
Description:P21554
Residue:472
BDBM21309
BDBM21244
NameBDBM21309
Synonyms:5-(oxan-4-ylmethyl)-7-[(2,2,3,3-tetramethylcyclopropyl)carbonyl]-2H,5H-[1,3]dioxolo[4,5-f]indole | Tetrahydropyranyl-methyl analogue, 30
TypeSmall organic molecule
Emp. Form.C23H29NO4
Mol. Mass.383.4807
SMILESCC1(C)C(C(=O)c2cn(CC3CCOCC3)c3cc4OCOc4cc23)C1(C)C