Reaction Details
TargetCannabinoid receptor 2
LigandBDBM21302
Substrate/CompetitorBDBM21244
Meas. Tech.Radioligand Binding Assay
Ki 9.3±n/a nM
EC50 501.5±n/a nM
Citation Frost, JMDart, MJTietje, KRGarrison, TRGrayson, GKDaza, AVEl-Kouhen, OFMiller, LNLi, LYao, BBHsieh, GCPai, MZhu, CZChandran, PMeyer, MD Indol-3-yl-tetramethylcyclopropyl Ketones: Effects of Indole Ring Substitution on CB2 Cannabinoid Receptor Activity. J Med Chem51:1904-12 (2008) 
 
Cannabinoid receptor 2
Name:Cannabinoid receptor 2
Type:G Protein-Coupled Receptor (GPCR)
Mol. Mass.:39690.94
Organism:Homo sapiens (Human)
Description:P34972
Residue:360
BDBM21302
BDBM21244
NameBDBM21302
Synonyms:4-(benzyloxy)-1-(oxan-4-ylmethyl)-3-[(2,2,3,3-tetramethylcyclopropyl)carbonyl]-1H-indole | Tetrahydropyranyl-methyl analogue, 23
TypeSmall organic molecule
Emp. Form.C29H35NO3
Mol. Mass.445.5931
SMILESCC1(C)C(C(=O)c2cn(CC3CCOCC3)c3cccc(OCc4ccccc4)c23)C1(C)C