Reaction Details
TargetCannabinoid receptor 2
LigandBDBM21306
Substrate/CompetitorBDBM21244
Meas. Tech.Radioligand Binding Assay
Ki 1.8±n/a nM
EC50>10000±n/a nM
Citation Frost, JMDart, MJTietje, KRGarrison, TRGrayson, GKDaza, AVEl-Kouhen, OFMiller, LNLi, LYao, BBHsieh, GCPai, MZhu, CZChandran, PMeyer, MD Indol-3-yl-tetramethylcyclopropyl Ketones: Effects of Indole Ring Substitution on CB2 Cannabinoid Receptor Activity. J Med Chem51:1904-12 (2008) 
 
Cannabinoid receptor 2
Name:Cannabinoid receptor 2
Type:G Protein-Coupled Receptor (GPCR)
Mol. Mass.:39690.94
Organism:Homo sapiens (Human)
Description:P34972
Residue:360
BDBM21306
BDBM21244
NameBDBM21306
Synonyms:5-(benzyloxy)-6-methoxy-1-(oxan-4-ylmethyl)-3-[(2,2,3,3-tetramethylcyclopropyl)carbonyl]-1H-indole | Tetrahydropyranyl-methyl analogue, 27
TypeSmall organic molecule
Emp. Form.C30H37NO4
Mol. Mass.475.6191
SMILESCOc1cc2n(CC3CCOCC3)cc(C(=O)C3C(C)(C)C3(C)C)c2cc1OCc1ccccc1