Reaction Details
TargetCannabinoid receptor 2
LigandBDBM21311
Substrate/CompetitorBDBM21244
Meas. Tech.Radioligand Binding Assay
Ki 4.4±n/a nM
EC50 17.5±n/a nM
Citation Frost, JMDart, MJTietje, KRGarrison, TRGrayson, GKDaza, AVEl-Kouhen, OFMiller, LNLi, LYao, BBHsieh, GCPai, MZhu, CZChandran, PMeyer, MD Indol-3-yl-tetramethylcyclopropyl Ketones: Effects of Indole Ring Substitution on CB2 Cannabinoid Receptor Activity. J Med Chem51:1904-12 (2008) 
 
Cannabinoid receptor 2
Name:Cannabinoid receptor 2
Type:G Protein-Coupled Receptor (GPCR)
Mol. Mass.:39690.94
Organism:Homo sapiens (Human)
Description:P34972
Residue:360
BDBM21311
BDBM21244
NameBDBM21311
Synonyms:4-(2-{3-[(2,2,3,3-tetramethylcyclopropyl)carbonyl]-1H-indol-1-yl}ethyl)morpholine Morpholino-ethyl analogue, 32
TypeSmall organic molecule
Emp. Form.C22H30N2O2
Mol. Mass.354.4858
SMILESCC1(C)C(C(=O)c2cn(CCN3CCOCC3)c3ccccc23)C1(C)C