Reaction Details
Target5-hydroxytryptamine receptor 7
LigandBDBM21369
Substrate/CompetitorBDBM21342
Meas. Tech.Radioligand Labeled Binding Assay
pH7.4±n/a
Temperature310.15±n/a K
Ki 15.2±3.2 nM
Citation Leopoldo, MLacivita, EContino, MColabufo, NABerardi, FPerrone, R Structure-activity relationship study on N-(1,2,3,4-tetrahydronaphthalen-1-yl)-4-aryl-1-piperazinehexanamides, a class of 5-HT7 receptor agents. 2. J Med Chem50:4214-21 (2007) 
 
5-hydroxytryptamine receptor 7
Name:5-hydroxytryptamine receptor 7
Type:G Protein-Coupled Receptor (GPCR)
Mol. Mass.:49852.62
Organism:Rattus norvegicus (rat)
Description:Rat cloned 5-HT7R.
Residue:448
BDBM21369
BDBM21342
NameBDBM21369
Synonyms:6-[4-(2-methylphenyl)piperazin-1-yl]-N-(1,2,3,4-tetrahydronaphthalen-1-yl)hexanamide Piperazinehexanamide derivative, 7
TypeSmall organic molecule
Emp. Form.C27H37N3O
Mol. Mass.419.6022
SMILESCc1ccccc1N1CCN(CCCCCC(=O)NC2CCCc3ccccc23)CC1