Reaction Details
Target5-hydroxytryptamine receptor 1A
LigandBDBM21367
Substrate/CompetitorBDBM21393
Meas. Tech.Radioligand Labeled Binding Assay
Ki 52.7±n/a nM
Citation Leopoldo, MLacivita, EContino, MColabufo, NABerardi, FPerrone, R Structure-activity relationship study on N-(1,2,3,4-tetrahydronaphthalen-1-yl)-4-aryl-1-piperazinehexanamides, a class of 5-HT7 receptor agents. 2. J Med Chem50:4214-21 (2007) 
 
5-hydroxytryptamine receptor 1A
Name:5-hydroxytryptamine receptor 1A
Type:n/a
Mol. Mass.:46122.49
Organism:Homo sapiens (Human)
Description:n/a
Residue:422
BDBM21367
BDBM21393
NameBDBM21367
Synonyms:6-{4-[2-(methylsulfanyl)phenyl]piperazin-1-yl}-N-(1,2,3,4-tetrahydronaphthalen-1-yl)hexanamide LP-44 | Piperazinehexanamide derivative, 5
TypeSmall organic molecule
Emp. Form.C27H37N3OS
Mol. Mass.451.667
SMILESCSc1ccccc1N1CCN(CCCCCC(=O)NC2CCCc3ccccc23)CC1