Reaction Details
Target5-hydroxytryptamine receptor 1A
LigandBDBM21391
Substrate/CompetitorBDBM21393
Meas. Tech.Radioligand Labeled Binding Assay
Ki 194±n/a nM
Citation Leopoldo, MLacivita, EContino, MColabufo, NABerardi, FPerrone, R Structure-activity relationship study on N-(1,2,3,4-tetrahydronaphthalen-1-yl)-4-aryl-1-piperazinehexanamides, a class of 5-HT7 receptor agents. 2. J Med Chem50:4214-21 (2007) 
 
5-hydroxytryptamine receptor 1A
Name:5-hydroxytryptamine receptor 1A
Type:n/a
Mol. Mass.:46122.49
Organism:Homo sapiens (Human)
Description:n/a
Residue:422
BDBM21391
BDBM21393
NameBDBM21391
Synonyms:1-oxido-2-{4-[5-(1,2,3,4-tetrahydronaphthalen-1-ylcarbamoyl)pentyl]piperazin-1-yl}pyridin-1-ium | Piperazinehexanamide derivative, 29
TypeSmall organic molecule
Emp. Form.C25H34N4O2
Mol. Mass.422.5631
SMILES[O-][n+]1ccccc1N1CCN(CCCCCC(=O)NC2CCCc3ccccc23)CC1