Reaction Details
Target5-hydroxytryptamine receptor 2A
LigandBDBM21372
Substrate/CompetitorBDBM21395
Meas. Tech.Radioligand Labeled Binding Assay
Ki 77.8±n/a nM
Citation Leopoldo, MLacivita, EContino, MColabufo, NABerardi, FPerrone, R Structure-activity relationship study on N-(1,2,3,4-tetrahydronaphthalen-1-yl)-4-aryl-1-piperazinehexanamides, a class of 5-HT7 receptor agents. 2. J Med Chem50:4214-21 (2007) 
 
5-hydroxytryptamine receptor 2A
Name:5-hydroxytryptamine receptor 2A
Type:G Protein-Coupled Receptor (GPCR)
Mol. Mass.:52852.05
Organism:Rattus norvegicus (rat)
Description:Rat cortex membranes 5-HT2A receptors.
Residue:471
BDBM21372
BDBM21395
NameBDBM21372
Synonyms:6-(4-phenylpiperazin-1-yl)-N-(1,2,3,4-tetrahydronaphthalen-1-yl)hexanamide Piperazinehexanamide derivative, 10
TypeSmall organic molecule
Emp. Form.C26H35N3O
Mol. Mass.405.5756
SMILESO=C(CCCCCN1CCN(CC1)c1ccccc1)NC1CCCc2ccccc12