Reaction Details
TargetD(2) dopamine receptor
LigandBDBM21370
Substrate/CompetitorBDBM21397
Meas. Tech.Radioligand Labeled Binding Assay
Ki 68±n/a nM
Citation Leopoldo, MLacivita, EContino, MColabufo, NABerardi, FPerrone, R Structure-activity relationship study on N-(1,2,3,4-tetrahydronaphthalen-1-yl)-4-aryl-1-piperazinehexanamides, a class of 5-HT7 receptor agents. 2. J Med Chem50:4214-21 (2007) 
 
D(2) dopamine receptor
Name:D(2) dopamine receptor
Type:Cell-surface receptors
Mol. Mass.:50647.10
Organism:Homo sapiens (Human)
Description:P14416
Residue:443
BDBM21370
BDBM21397
NameBDBM21370
Synonyms:6-[4-(2-acetylphenyl)piperazin-1-yl]-N-(1,2,3,4-tetrahydronaphthalen-1-yl)hexanamide Piperazinehexanamide derivative, 8
TypeSmall organic molecule
Emp. Form.C28H37N3O2
Mol. Mass.447.6123
SMILESCC(=O)c1ccccc1N1CCN(CCCCCC(=O)NC2CCCc3ccccc23)CC1