Reaction Details
TargetMu-type opioid receptor
LigandBDBM309410
Substrate/Competitorn/a
Meas. Tech.Opioid Receptor Binding Assay
EC50 0.190±n/a nM
Citation Blumberg, LCDeaver, DREyerman, DJWynn, TA Methods for treating depressive symptoms US Patent US10231963 Publication Date 3/19/2019
 
Mu-type opioid receptor
Name:Mu-type opioid receptor
Type:G Protein-Coupled Receptor (GPCR)
Mol. Mass.:44789.51
Organism:Homo sapiens (Human)
Description:P35372
Residue:400
BDBM309410
NameBDBM309410
Synonyms:US10231963, Table B.13 US9656961, Example 00130
TypeSmall organic molecule
Emp. Form.C28H31NO4
Mol. Mass.445.55
SMILESOc1ccc2C[C@H]3N(CC=C)CC[C@@]45[C@@H](Oc1c24)C(=O)CC[C@@]35OCCCc1ccccc1