Reaction Details
TargetMu-type opioid receptor
LigandBDBM179874
Substrate/Competitorn/a
Meas. Tech.Opioid Receptor Binding Assay
Ki 0.110±n/a nM
Citation Blumberg, LCDeaver, DREyerman, DJWynn, TA Methods for treating depressive symptoms US Patent US10231963 Publication Date 3/19/2019
 
Mu-type opioid receptor
Name:Mu-type opioid receptor
Type:G Protein-Coupled Receptor (GPCR)
Mol. Mass.:44789.51
Organism:Homo sapiens (Human)
Description:P35372
Residue:400
BDBM179874
NameBDBM179874
Synonyms:US10231963, Table B.18 US10736890, Compound TABLE B.21 US11534436, Compound Table B.18 US9656961, Example 00135
TypeSmall organic molecule
Emp. Form.C23H30N2O3
Mol. Mass.382.4959
SMILESNC(=O)c1ccc2C[C@H]3N(CC4CCC4)CC[C@@]4(CC(=C)CC[C@@]34O)c2c1O