Reaction Details
TargetMu-type opioid receptor
LigandBDBM50278263
Substrate/Competitorn/a
Meas. Tech.Opioid Receptor Binding Assay
IC50 3.80±n/a nM
Citation Blumberg, LCDeaver, DREyerman, DJWynn, TA Methods for treating depressive symptoms US Patent US10231963 Publication Date 3/19/2019
 
Mu-type opioid receptor
Name:Mu-type opioid receptor
Type:G Protein-Coupled Receptor (GPCR)
Mol. Mass.:44789.51
Organism:Homo sapiens (Human)
Description:P35372
Residue:400
BDBM50278263
NameBDBM50278263
Synonyms:(1R,9R,10S,13R)-17-(cyclobutylmethyl)-3,10,13-trihydroxy-17-azatetracyclo[7.5.3.0^{1,10}.0^{2,7}]heptadeca-2(7),3,5-triene-4-carboxamide US10231963, Table B.20 US10736890, Compound TABLE B.20 US11534436, Compound Table B.20 US9656961, Example 00137
TypeSmall organic molecule
Emp. Form.C22H30N2O4
Mol. Mass.386.4846
SMILESNC(=O)c1ccc2C[C@H]3N(CC4CCC4)CC[C@@]4(C[C@H](O)CC[C@@]34O)c2c1O