Reaction Details
TargetMu-type opioid receptor
LigandBDBM179877
Substrate/Competitorn/a
Meas. Tech.Opioid Receptor Binding Assay
EC50 0.390±n/a nM
Citation Blumberg, LCDeaver, DREyerman, DJWynn, TA Methods for treating depressive symptoms US Patent US10231963 Publication Date 3/19/2019
 
Mu-type opioid receptor
Name:Mu-type opioid receptor
Type:G Protein-Coupled Receptor (GPCR)
Mol. Mass.:44789.51
Organism:Homo sapiens (Human)
Description:P35372
Residue:400
BDBM179877
NameBDBM179877
Synonyms:US10231963, Table B.23 US10752592, Compound TABLE B.5 US9133125, Table B, Compound 5 | US9656961, Example 00140
TypeSmall organic molecule
Emp. Form.C22H28N2O3
Mol. Mass.368.4693
SMILESNC(=O)c1ccc2C[C@@H]3[C@@H]4CCC(=O)C[C@]4(CCN3CC3CCC3)c2c1O