Reaction Details
TargetMu-type opioid receptor
LigandBDBM179881
Substrate/Competitorn/a
Meas. Tech.Opioid Receptor Binding Assay
Ki 0.500±n/a nM
Citation Blumberg, LCDeaver, DREyerman, DJWynn, TA Methods for treating depressive symptoms US Patent US10231963 Publication Date 3/19/2019
 
Mu-type opioid receptor
Name:Mu-type opioid receptor
Type:G Protein-Coupled Receptor (GPCR)
Mol. Mass.:44789.51
Organism:Homo sapiens (Human)
Description:P35372
Residue:400
BDBM179881
NameBDBM179881
Synonyms:US10231963, Table B.27 US10736890, Compound TABLE B.27 US11534436, Compound Table B.27 US9656961, Example 00144
TypeSmall organic molecule
Emp. Form.C23H30N2O3
Mol. Mass.382.4959
SMILES[#6]\[#6](-[#6])=[#6]\[#6]-[#7]-1-[#6]-[#6][C@]23[#6]-[#6](=[#6])-[#6]-[#6][C@@]2([#8])[#6@H]-1-[#6]-c1ccc(-[#6](-[#7])=O)c(-[#8])c31