Reaction Details
TargetMu-type opioid receptor
LigandBDBM179898
Substrate/Competitorn/a
Meas. Tech.Opioid Receptor Binding Assay
Ki 0.140±n/a nM
Citation Blumberg, LCDeaver, DREyerman, DJWynn, TA Methods for treating depressive symptoms US Patent US10231963 Publication Date 3/19/2019
 
Mu-type opioid receptor
Name:Mu-type opioid receptor
Type:G Protein-Coupled Receptor (GPCR)
Mol. Mass.:44789.51
Organism:Homo sapiens (Human)
Description:P35372
Residue:400
BDBM179898
NameBDBM179898
Synonyms:US10231963, Table C.2 US10736890, Compound TABLE C.2 US11534436, Compound Table C.2 US9656961, Example 00166
TypeSmall organic molecule
Emp. Form.C22H28N2O4
Mol. Mass.384.4687
SMILESC[C@@H](C1CC1)N1CC[C@]23CC(=O)CC[C@@]2(O)[C@H]1Cc1ccc(C(N)=O)c(O)c31