Reaction Details
TargetAmyloid-beta precursor protein
LigandBDBM50393099
Substrate/Competitorn/a
Meas. Tech.sAPPbeta Release Assay
IC50 0.100±n/a nM
Citation Csjernyik, GKarlstrom, SKers, AKolmodin, KNylof, MOhberg, LRakos, LSandberg, LSehgelmeble, FSoderman, PSwahn, BVon Berg, S Compounds and their use as BACE inhibitors US Patent US10231967 Publication Date 3/19/2019
 
Amyloid-beta precursor protein
Name:Amyloid-beta precursor protein
Type:Single-pass type I membrane protein
Mol. Mass.:86890.41
Organism:Homo sapiens (Human)
Description:P05067
Residue:770
BDBM50393099
NameBDBM50393099
Synonyms:CHEMBL2152914 US9918985, Example 122
TypeSmall organic molecule
Emp. Form.C26H28N4O
Mol. Mass.412.5267
SMILESCO[C@H]1CC[C@@]2(Cc3ccc(cc3C22N=C(C)C(N)=N2)-c2cncc(c2)C#CC)CC1